Target
Serine/threonine-protein kinase mTOR
Ligand
BDBM50430790
Substrate
Meas. Tech.
ChEMBL_943417 (CHEMBL2341381)
Ki
1.2±n/a nM
Citation
 Estrada, AAShore, DGBlackwood, EChen, YHDeshmukh, GDing, XDipasquale, AGEpler, JAFriedman, LSKoehler, MFLiu, LMalek, SNonomiya, JOrtwine, DFPei, ZSideris, SSt-Jean, FTrinh, LTruong, TLyssikatos, JP Pyrimidoaminotropanes as potent, selective, and efficacious small molecule kinase inhibitors of the mammalian target of rapamycin (mTOR). J Med Chem 56:3090-101 (2013)  
Target
Name:
Serine/threonine-protein kinase mTOR
Synonyms:
FK506-binding protein 12-rapamycin complex-associated protein 1 FRAP FRAP1 MTOR Mammalian Target of Rapamycin (mTOR) RAFT1 Rapamycin and FKBP12 target 1 Serine/threonine-protein kinase (mTOR) | mTORC2
Type:
Rapamycin target protein
Mol. Mass.:
288917.12
Organism:
Homo sapiens (Human)
Description:
P42345
Residue:
2549
  
Inhibitor
Name:
BDBM50430790
Synonyms:
CHEMBL2334761
Type:
Small organic molecule
Emp. Form.:
C24H32N6O2
Mol. Mass.:
436.5499
SMILES:
CCNC(=O)Nc1ccc(cc1)-c1nc2[C@H]3CC[C@@H](Cc2c(n1)N1CCOC[C@@H]1C)N3C
: