Target
CREB-binding protein
Ligand
BDBM50430827
Substrate
Meas. Tech.
ChEMBL_944373 (CHEMBL2344877)
IC50
1100±n/a nM
Citation
 Hewings, DSFedorov, OFilippakopoulos, PMartin, SPicaud, STumber, AWells, COlcina, MMFreeman, KGill, ARitchie, AJSheppard, DWRussell, AJHammond, EMKnapp, SBrennan, PEConway, SJ Optimization of 3,5-dimethylisoxazole derivatives as potent bromodomain ligands. J Med Chem 56:3217-27 (2013)  
Target
Name:
CREB-binding protein
Synonyms:
CBP CREB-binding protein (CBP) CREBBP
Type:
Transcription Coactivator
Mol. Mass.:
265411.66
Organism:
Homo sapiens (Human)
Description:
Q92793
Residue:
2442
  
Inhibitor
Name:
BDBM50430827
Synonyms:
CHEMBL2335147
Type:
Small organic molecule
Emp. Form.:
C18H17NO3
Mol. Mass.:
295.3325
SMILES:
Cc1noc(C)c1-c1cc(O)cc(c1)[C@H](O)c1ccccc1
: