Target
Discoidin domain-containing receptor 2
Ligand
BDBM50430861
Substrate
Meas. Tech.
ChEMBL_945425 (CHEMBL2342536)
IC50
>1000±n/a nM
Citation
 Gao, MDuan, LLuo, JZhang, LLu, XZhang, YZhang, ZTu, ZXu, YRen, XDing, K Discovery and optimization of 3-(2-(Pyrazolo[1,5-a]pyrimidin-6-yl)ethynyl)benzamides as novel selective and orally bioavailable discoidin domain receptor 1 (DDR1) inhibitors. J Med Chem 56:3281-95 (2013)  
Target
Name:
Discoidin domain-containing receptor 2
Synonyms:
DDR2 Discoidin domain receptor 2 (DDR2) Discoidin domain-containing receptor 2 (DDR2) NTRKR3 TYRO10
Type:
Protein
Mol. Mass.:
96717.07
Organism:
Homo sapiens (Human)
Description:
Q16832
Residue:
855
  
Inhibitor
Name:
BDBM50430861
Synonyms:
CHEMBL2336018
Type:
Small organic molecule
Emp. Form.:
C23H18N4O2
Mol. Mass.:
382.4146
SMILES:
COc1ccc(NC(=O)c2ccc(C)c(c2)C#Cc2cnc3ccnn3c2)cc1
: