Target
Proteasome subunit beta type-5
Ligand
BDBM50430964
Substrate
Meas. Tech.
ChEMBL_947294 (CHEMBL2343600)
IC50
460±n/a nM
Citation
 Desvergne, AGenin, EMaréchal, XGallastegui, NDufau, LRichy, NGroll, MVidal, JReboud-Ravaux, M Dimerized linear mimics of a natural cyclopeptide (TMC-95A) are potent noncovalent inhibitors of the eukaryotic 20S proteasome. J Med Chem 56:3367-78 (2013)  
Target
Name:
Proteasome subunit beta type-5
Synonyms:
20S proteasome chymotrypsin-like LMPX PSB5_HUMAN Proteasome Macropain subunit MB1 X
Type:
Protein
Mol. Mass.:
28480.96
Organism:
Homo sapiens (Human)
Description:
Residue:
263
  
Inhibitor
Name:
BDBM50430964
Synonyms:
CHEMBL2337841
Type:
Small organic molecule
Emp. Form.:
C60H80N8O11
Mol. Mass.:
1089.3242
SMILES:
C[C@H](NC(=O)[C@H](Cc1ccc(OCc2ccccc2)cc1)NC(=O)CCCCCNC(=O)CCCCCNC(=O)CCCCCNC(=O)OC(C)(C)C)C(=O)N[C@@H](C[C@]1(O)C(=O)Nc2ccccc12)C(=O)NCc1ccccc1
: