Target
Proteasome subunit beta type-1
Ligand
BDBM50430967
Substrate
Meas. Tech.
ChEMBL_946854 (CHEMBL2345965)
IC50
60±n/a nM
Citation
 Desvergne, AGenin, EMaréchal, XGallastegui, NDufau, LRichy, NGroll, MVidal, JReboud-Ravaux, M Dimerized linear mimics of a natural cyclopeptide (TMC-95A) are potent noncovalent inhibitors of the eukaryotic 20S proteasome. J Med Chem 56:3367-78 (2013)  
Target
Name:
Proteasome subunit beta type-1
Synonyms:
PSB1_HUMAN PSMB1 Proteasome subunit beta type-1/beta type-5
Type:
PROTEIN
Mol. Mass.:
26493.62
Organism:
Homo sapiens (Human)
Description:
ChEMBL_1366691
Residue:
241
  
Inhibitor
Name:
BDBM50430967
Synonyms:
CHEMBL2337848
Type:
Small organic molecule
Emp. Form.:
C34H39N5O10
Mol. Mass.:
677.701
SMILES:
CC[C@H](C)C(=O)C(=O)N[C@H]1Cc2ccc(O)c(c2)-c2cccc3c2NC(=O)[C@@]3(O)[C@H](O)[C@H](NC(=O)[C@H](CC(N)=O)CC1=O)C(=O)N\C=C/C
: