Target
Alpha-ketoglutarate-dependent dioxygenase FTO
Ligand
BDBM50431012
Substrate
Meas. Tech.
ChEMBL_947323 (CHEMBL2344107)
IC50
>1000000±n/a nM
Citation
 Aik, WDemetriades, MHamdan, MKBagg, EAYeoh, KKLejeune, CZhang, ZMcDonough, MASchofield, CJ Structural basis for inhibition of the fat mass and obesity associated protein (FTO). J Med Chem 56:3680-8 (2013)  
Target
Name:
Alpha-ketoglutarate-dependent dioxygenase FTO
Synonyms:
FTO Fat mass and obesity-associated protein | KIAA1752
Type:
PROTEIN
Mol. Mass.:
58263.75
Organism:
Homo sapiens (Human)
Description:
ChEMBL_1515854
Residue:
505
  
Inhibitor
Name:
BDBM50431012
Synonyms:
CHEMBL2338332
Type:
Small organic molecule
Emp. Form.:
C25H40N7O19P3S
Mol. Mass.:
867.607
SMILES:
CC(C)(COP(O)(=O)OP(O)(=O)OC[C@H]1O[C@H]([C@H](O)[C@@H]1OP(O)(O)=O)n1cnc2c(N)ncnc12)[C@H](O)C(=O)NCCC(=O)NCCSC(=O)CCC(O)=O
: