Target
MAP kinase-activated protein kinase 2
Ligand
BDBM50431028
Substrate
Meas. Tech.
ChEMBL_947327 (CHEMBL2344111)
IC50
9800±n/a nM
Citation
 Brown, AShi, QMoore, TWYoon, YPrussia, AMaddox, CLiotta, DCShim, HSnyder, JP Monocarbonyl curcumin analogues: heterocyclic pleiotropic kinase inhibitors that mediate anticancer properties. J Med Chem 56:3456-66 (2013)  
Target
Name:
MAP kinase-activated protein kinase 2
Synonyms:
MAP kinase-activated protein kinase 2 (MAPKAPK2) MAP kinase-activated protein kinase 2 (p38/MK2) MAPK-activated protein kinase 2 MAPKAP kinase 2 MAPKAPK2 | MK2
Type:
Serine/threonine-protein kinase
Mol. Mass.:
45579.87
Organism:
Homo sapiens (Human)
Description:
P49137
Residue:
400
  
Inhibitor
Name:
BDBM50431028
Synonyms:
CHEMBL2338333
Type:
Small organic molecule
Emp. Form.:
C18H17N3O
Mol. Mass.:
291.3471
SMILES:
CN1C\C(=C/c2ccccn2)C(=O)\C(C1)=C\c1ccccn1
: