Target
D-amino-acid oxidase
Ligand
BDBM50431071
Substrate
Meas. Tech.
ChEMBL_947856 (CHEMBL2343132)
IC50
>1000±n/a nM
Citation
 Hondo, TWarizaya, MNiimi, TNamatame, IYamaguchi, TNakanishi, KHamajima, THarada, KSakashita, HMatsumoto, YOrita, MTakeuchi, M 4-Hydroxypyridazin-3(2H)-one derivatives as novel D-amino acid oxidase inhibitors. J Med Chem 56:3582-92 (2013)  
Target
Name:
D-amino-acid oxidase
Synonyms:
D-amino-acid oxidase (DAAO) DAMOX OXDA_HUMAN
Type:
Homodimer
Mol. Mass.:
39476.06
Organism:
Homo sapiens (Human)
Description:
P14920
Residue:
347
  
Inhibitor
Name:
BDBM50431071
Synonyms:
CHEMBL2338793
Type:
Small organic molecule
Emp. Form.:
C10H16N2O2
Mol. Mass.:
196.2462
SMILES:
CC(C)(C)CCc1cc(O)c(=O)[nH]n1
: