Target
NAD-dependent protein deacetylase sirtuin-3, mitochondrial
Ligand
BDBM50431113
Substrate
Meas. Tech.
ChEMBL_948316 (CHEMBL2340697)
IC50
300±n/a nM
Citation
 Disch, JSEvindar, GChiu, CHBlum, CADai, HJin, LSchuman, ELind, KEBelyanskaya, SLDeng, JCoppo, FAquilani, LGraybill, TLCuozzo, JWLavu, SMao, CVlasuk, GPPerni, RB Discovery of thieno[3,2-d]pyrimidine-6-carboxamides as potent inhibitors of SIRT1, SIRT2, and SIRT3. J Med Chem 56:3666-79 (2013)  
Target
Name:
NAD-dependent protein deacetylase sirtuin-3, mitochondrial
Synonyms:
NAD-dependent deacetylase sirtuin 3 SIR2L3 SIRT3
Type:
Protein
Mol. Mass.:
43582.69
Organism:
Homo sapiens (Human)
Description:
Q9NTG7
Residue:
399
  
Inhibitor
Name:
BDBM50431113
Synonyms:
CHEMBL2332046
Type:
Small organic molecule
Emp. Form.:
C14H19N5OS
Mol. Mass.:
305.399
SMILES:
NCCC1CCN(CC1)c1ncnc2cc(sc12)C(N)=O
: