Target
NAD-dependent protein deacetylase sirtuin-2
Ligand
BDBM50431102
Substrate
Meas. Tech.
ChEMBL_948317 (CHEMBL2341151)
IC50
300±n/a nM
Citation
 Disch, JSEvindar, GChiu, CHBlum, CADai, HJin, LSchuman, ELind, KEBelyanskaya, SLDeng, JCoppo, FAquilani, LGraybill, TLCuozzo, JWLavu, SMao, CVlasuk, GPPerni, RB Discovery of thieno[3,2-d]pyrimidine-6-carboxamides as potent inhibitors of SIRT1, SIRT2, and SIRT3. J Med Chem 56:3666-79 (2013)  
Target
Name:
NAD-dependent protein deacetylase sirtuin-2
Synonyms:
NAD-Dependent Deacetylase Sirtuin-2 NAD-dependent deacetylase sirtuin 3 SIR2-like SIR2L SIR2_HUMAN Sirtuin 2 (SIRT2)
Type:
Hydrolase
Mol. Mass.:
43172.62
Organism:
Homo sapiens (Human)
Description:
Residue:
389
  
Inhibitor
Name:
BDBM50431102
Synonyms:
CHEMBL2338817
Type:
Small organic molecule
Emp. Form.:
C20H28N4O2S
Mol. Mass.:
388.527
SMILES:
CC(C)(C)C(=O)NCCC1CCN(CC1)c1nccc2cc(sc12)C(N)=O
: