Target
NAD-dependent protein deacetylase sirtuin-2
Ligand
BDBM50431106
Substrate
Meas. Tech.
ChEMBL_948317 (CHEMBL2341151)
IC50
130±n/a nM
Citation
 Disch, JSEvindar, GChiu, CHBlum, CADai, HJin, LSchuman, ELind, KEBelyanskaya, SLDeng, JCoppo, FAquilani, LGraybill, TLCuozzo, JWLavu, SMao, CVlasuk, GPPerni, RB Discovery of thieno[3,2-d]pyrimidine-6-carboxamides as potent inhibitors of SIRT1, SIRT2, and SIRT3. J Med Chem 56:3666-79 (2013)  
Target
Name:
NAD-dependent protein deacetylase sirtuin-2
Synonyms:
NAD-Dependent Deacetylase Sirtuin-2 NAD-dependent deacetylase sirtuin 3 SIR2-like SIR2L SIR2_HUMAN Sirtuin 2 (SIRT2)
Type:
Hydrolase
Mol. Mass.:
43172.62
Organism:
Homo sapiens (Human)
Description:
Residue:
389
  
Inhibitor
Name:
BDBM50431106
Synonyms:
CHEMBL2332053
Type:
Small organic molecule
Emp. Form.:
C15H20N6OS2
Mol. Mass.:
364.489
SMILES:
CC(=S)NCCN1CCN(CC1)c1ncnc2cc(sc12)C(N)=O
: