Target
Poly [ADP-ribose] polymerase tankyrase-1
Ligand
BDBM26659
Substrate
Meas. Tech.
ChEMBL_948354 (CHEMBL2341188)
IC50
280±n/a nM
Citation
 Narwal, MHaikarainen, TFallarero, AVuorela, PMLehtiö, L Screening and structural analysis of flavones inhibiting tankyrases. J Med Chem 56:3507-17 (2013)  
Target
Name:
Poly [ADP-ribose] polymerase tankyrase-1
Synonyms:
(ARTD5 or PARP5a) PARPL Poly [ADP-ribose] polymerase tankyrase-1 TINF1 TNKS1 Tankyrase 1 Tankyrase-1 Tankyrase-1 (TNKS1)
Type:
Enzyme
Mol. Mass.:
142058.03
Organism:
Homo sapiens (Human)
Description:
O95271
Residue:
1327
  
Inhibitor
Name:
BDBM26659
Synonyms:
7,3-dihydroxyflavone | 7-hydroxy-2-(3-hydroxyphenyl)-4H-chromen-4-one
Type:
Flavonoid
Emp. Form.:
C15H10O4
Mol. Mass.:
254.2375
SMILES:
Oc1cccc(c1)-c1cc(=O)c2ccc(O)cc2o1
: