Target
Prolyl endopeptidase
Ligand
BDBM50431234
Substrate
Meas. Tech.
ChEMBL_949252 (CHEMBL2346128)
IC50
440±n/a nM
Citation
 Poplawski, SELai, JHLi, YJin, ZLiu, YWu, WWu, YZhou, YSudmeier, JLSanford, DGBachovchin, WW Identification of selective and potent inhibitors of fibroblast activation protein and prolyl oligopeptidase. J Med Chem 56:3467-77 (2013)  
Target
Name:
Prolyl endopeptidase
Synonyms:
PE POP PREP Prolyl oligopeptidase
Type:
Enzyme
Mol. Mass.:
80688.50
Organism:
Homo sapiens (Human)
Description:
P48147
Residue:
710
  
Inhibitor
Name:
BDBM50431234
Synonyms:
CHEMBL2332620
Type:
Small organic molecule
Emp. Form.:
C17H20BN3O5
Mol. Mass.:
357.169
SMILES:
OC[C@@H](NC(=O)c1ccnc2ccccc12)C(=O)N1CCC[C@H]1B(O)O
: