Target
Prolyl endopeptidase
Ligand
BDBM50431241
Substrate
Meas. Tech.
ChEMBL_949252 (CHEMBL2346128)
IC50
1800±n/a nM
Citation
 Poplawski, SELai, JHLi, YJin, ZLiu, YWu, WWu, YZhou, YSudmeier, JLSanford, DGBachovchin, WW Identification of selective and potent inhibitors of fibroblast activation protein and prolyl oligopeptidase. J Med Chem 56:3467-77 (2013)  
Target
Name:
Prolyl endopeptidase
Synonyms:
PE POP PREP Prolyl oligopeptidase
Type:
Enzyme
Mol. Mass.:
80688.50
Organism:
Homo sapiens (Human)
Description:
P48147
Residue:
710
  
Inhibitor
Name:
BDBM50431241
Synonyms:
CHEMBL2333027
Type:
Small organic molecule
Emp. Form.:
C14H19BN2O4
Mol. Mass.:
290.123
SMILES:
C[C@@H](NC(=O)c1ccccc1)C(=O)N1CCC[C@H]1B(O)O
: