Target
Prolyl endopeptidase FAP
Ligand
BDBM50431228
Substrate
Meas. Tech.
ChEMBL_949253 (CHEMBL2346129)
IC50
1.1±n/a nM
Citation
 Poplawski, SELai, JHLi, YJin, ZLiu, YWu, WWu, YZhou, YSudmeier, JLSanford, DGBachovchin, WW Identification of selective and potent inhibitors of fibroblast activation protein and prolyl oligopeptidase. J Med Chem 56:3467-77 (2013)  
Target
Name:
Prolyl endopeptidase FAP
Synonyms:
170 kDa melanoma membrane-bound gelatinase Fibroblast Activation Protein (FAP) Integral membrane serine protease Seprase
Type:
Enzyme
Mol. Mass.:
87712.48
Organism:
Homo sapiens (Human)
Description:
Q12884
Residue:
760
  
Inhibitor
Name:
BDBM50431228
Synonyms:
CHEMBL2333023
Type:
Small organic molecule
Emp. Form.:
C12H16BN3O4
Mol. Mass.:
277.084
SMILES:
OB(O)[C@@H]1CCCN1C(=O)CNC(=O)c1cccnc1
: