Target
Prolyl endopeptidase FAP
Ligand
BDBM50431236
Substrate
Meas. Tech.
ChEMBL_949253 (CHEMBL2346129)
IC50
9.4±n/a nM
Citation
 Poplawski, SELai, JHLi, YJin, ZLiu, YWu, WWu, YZhou, YSudmeier, JLSanford, DGBachovchin, WW Identification of selective and potent inhibitors of fibroblast activation protein and prolyl oligopeptidase. J Med Chem 56:3467-77 (2013)  
Target
Name:
Prolyl endopeptidase FAP
Synonyms:
170 kDa melanoma membrane-bound gelatinase Fibroblast Activation Protein (FAP) Integral membrane serine protease Seprase
Type:
Enzyme
Mol. Mass.:
87712.48
Organism:
Homo sapiens (Human)
Description:
Q12884
Residue:
760
  
Inhibitor
Name:
BDBM50431236
Synonyms:
CHEMBL2332618
Type:
Small organic molecule
Emp. Form.:
C13H17BClN3O4
Mol. Mass.:
325.556
SMILES:
C[C@@H](NC(=O)c1ccnc(Cl)c1)C(=O)N1CCC[C@H]1B(O)O
: