Target
Dipeptidyl peptidase 9
Ligand
BDBM50431242
Substrate
Meas. Tech.
ChEMBL_949254 (CHEMBL2346130)
IC50
3400±n/a nM
Citation
 Poplawski, SELai, JHLi, YJin, ZLiu, YWu, WWu, YZhou, YSudmeier, JLSanford, DGBachovchin, WW Identification of selective and potent inhibitors of fibroblast activation protein and prolyl oligopeptidase. J Med Chem 56:3467-77 (2013)  
Target
Name:
Dipeptidyl peptidase 9
Synonyms:
DPP9 DPRP-2 Dipeptidyl peptidase 9 (DDP9) Dipeptidyl peptidase 9 (DPP9) Dipeptidyl peptidase IX Dipeptidyl peptidase-like protein 9
Type:
Enzyme
Mol. Mass.:
98260.70
Organism:
Homo sapiens (Human)
Description:
Q86TI2
Residue:
863
  
Inhibitor
Name:
BDBM50431242
Synonyms:
CHEMBL2333026
Type:
Small organic molecule
Emp. Form.:
C13H18BN3O4
Mol. Mass.:
291.111
SMILES:
C[C@@H](NC(=O)c1ccncc1)C(=O)N1CCC[C@H]1B(O)O
: