Target
Tyrosine-protein kinase receptor TYRO3
Ligand
BDBM50431280
Substrate
Meas. Tech.
ChEMBL_950787 (CHEMBL2353693)
Kd
900±n/a nM
Citation
 Suárez, RMChevot, FCavagnino, ASaettel, NRadvanyi, FPiguel, SBernard-Pierrot, IStoven, VLegraverend, M Inhibitors of the TAM subfamily of tyrosine kinases: synthesis and biological evaluation. Eur J Med Chem 61:2-25 (2013)  
Target
Name:
Tyrosine-protein kinase receptor TYRO3
Synonyms:
BYK RSE TIF TYRO3_HUMAN | Tyrosine-protein kinase SKY
Type:
Protein
Mol. Mass.:
96894.13
Organism:
Homo sapiens (Human)
Description:
Q06418
Residue:
890
  
Inhibitor
Name:
BDBM50431280
Synonyms:
CHEMBL2348263
Type:
Small organic molecule
Emp. Form.:
C23H14F2N6O3
Mol. Mass.:
460.3925
SMILES:
Fc1cccc(c1)-n1cccc(C(=O)Nc2ccc(Oc3ncnc4nc[nH]c34)c(F)c2)c1=O
: