Target
Tyrosine-protein kinase Mer
Ligand
BDBM50384576
Substrate
Meas. Tech.
ChEMBL_951056 (CHEMBL2352094)
IC50
2.9±n/a nM
Citation
 Suárez, RMChevot, FCavagnino, ASaettel, NRadvanyi, FPiguel, SBernard-Pierrot, IStoven, VLegraverend, M Inhibitors of the TAM subfamily of tyrosine kinases: synthesis and biological evaluation. Eur J Med Chem 61:2-25 (2013)  
Target
Name:
Tyrosine-protein kinase Mer
Synonyms:
MER MERTK Proto-oncogene c-Mer Receptor tyrosine kinase MerTK | Tyrosine-protein kinase Mer
Type:
PROTEIN
Mol. Mass.:
110234.77
Organism:
Homo sapiens (Human)
Description:
ChEMBL_1498723
Residue:
999
  
Inhibitor
Name:
BDBM50384576
Synonyms:
CHEMBL2036808
Type:
Small organic molecule
Emp. Form.:
C22H29FN6
Mol. Mass.:
396.5043
SMILES:
CCCCNc1ncc2c(nn(C[C@H]3CC[C@H](N)CC3)c2n1)-c1ccc(F)cc1
: