Target
Protein-tyrosine kinase 2-beta
Ligand
BDBM50430297
Substrate
Meas. Tech.
ChEMBL_951380 (CHEMBL2349754)
IC50
>30000±n/a nM
Citation
 Iwatani, MIwata, HOkabe, ASkene, RJTomita, NHayashi, YAramaki, YHosfield, DJHori, ABaba, AMiki, H Discovery and characterization of novel allosteric FAK inhibitors. Eur J Med Chem 61:49-60 (2013)  
Target
Name:
Protein-tyrosine kinase 2-beta
Synonyms:
FAK2 PTK2B PTK2B protein tyrosine kinase 2 beta (PTK2B) Protein tyrosine kinase 2 beta | RAFTK
Type:
Protein
Mol. Mass.:
115868.80
Organism:
Homo sapiens (Human)
Description:
Q14289
Residue:
1009
  
Inhibitor
Name:
BDBM50430297
Synonyms:
CHEMBL2333436
Type:
Small organic molecule
Emp. Form.:
C20H21N3O2S
Mol. Mass.:
367.465
SMILES:
CCc1ccc(cc1)-c1ccc2N(C)S(=O)(=O)c3cnn(CC)c3-c2c1
: