Target
Tyrosine-protein kinase Fgr
Ligand
BDBM50430289
Substrate
Meas. Tech.
ChEMBL_951388 (CHEMBL2349762)
IC50
1900±n/a nM
Citation
 Iwatani, MIwata, HOkabe, ASkene, RJTomita, NHayashi, YAramaki, YHosfield, DJHori, ABaba, AMiki, H Discovery and characterization of novel allosteric FAK inhibitors. Eur J Med Chem 61:49-60 (2013)  
Target
Name:
Tyrosine-protein kinase Fgr
Synonyms:
FGR Gardner-Rasheed feline sarcoma viral (v-fgr) oncogene homolog SRC p55-Fgr p58c-Fgr
Type:
protein
Mol. Mass.:
59469.88
Organism:
Homo sapiens (Human)
Description:
P09769
Residue:
529
  
Inhibitor
Name:
BDBM50430289
Synonyms:
CHEMBL2333445
Type:
Small organic molecule
Emp. Form.:
C18H17N3O2S
Mol. Mass.:
339.411
SMILES:
CCc1ccc(cc1)-c1ccc2N(C)S(=O)(=O)c3c[nH]nc3-c2c1
: