Target
Mitogen-activated protein kinase kinase kinase 5
Ligand
BDBM50431318
Substrate
Meas. Tech.
ChEMBL_952963 (CHEMBL2352238)
IC50
750±n/a nM
Citation
 Volynets, GPBdzhola, VGGolub, AGSynyugin, ARChekanov, MAKukharenko, OPYarmoluk, SM Rational design of apoptosis signal-regulating kinase 1 inhibitors: discovering novel structural scaffold. Eur J Med Chem 61:104-15 (2013)  
Target
Name:
Mitogen-activated protein kinase kinase kinase 5
Synonyms:
ASK1 MAP3K5 MEKK5
Type:
Protein
Mol. Mass.:
154514.93
Organism:
Homo sapiens (Human)
Description:
Q99683
Residue:
1374
  
Inhibitor
Name:
BDBM50431318
Synonyms:
CHEMBL2349203
Type:
Small organic molecule
Emp. Form.:
C19H15Cl2NO4S3
Mol. Mass.:
488.428
SMILES:
CSCCC(N1C(=S)S\C(=C/c2ccc(o2)-c2ccc(Cl)c(Cl)c2)C1=O)C(O)=O
: