Target
Cyclin-H/Cyclin-dependent kinase 7
Ligand
BDBM50431343
Substrate
Meas. Tech.
ChEMBL_954060 (CHEMBL2350828)
Ki
3474±n/a nM
Citation
 Shao, HShi, SHuang, SHole, AJAbbas, AYBaumli, SLiu, XLam, FFoley, DWFischer, PMNoble, MEndicott, JAPepper, CWang, S Substituted 4-(thiazol-5-yl)-2-(phenylamino)pyrimidines are highly active CDK9 inhibitors: synthesis, X-ray crystal structures, structure-activity relationship, and anticancer activities. J Med Chem 56:640-59 (2013)  
Target
Name:
Cyclin-H/Cyclin-dependent kinase 7
Synonyms:
CDK-activating kinase assembly factor MAT1/Cyclin H/Cyclin-dependent kinase 7 CDK7/H Cyclin-Dependent Kinase 7 (CDK7) Cyclin-dependent kinase 7/cyclin H
Type:
Protein Complex
Mol. Mass.:
Description:
Components:
This complex has 2 components.
Component 1
Name:
Cyclin-H
Synonyms:
CCNH Cyclin H p34 | p37
Type:
Enzyme Subunit
Mol. Mass.:
37646.05
Organism:
Homo sapiens (Human)
Description:
Residue:
323
  
Component 2
Name:
Cyclin-dependent kinase 7
Synonyms:
39 kDa protein kinase CAK1 CDK-activating kinase 1 (CAK) CDK7_HUMAN Cell division protein kinase 7 Cyclin-dependent kinase 7 (CDK7/cyclin H) P39 Mo15 TFIIH basal transcription factor complex kinase subunit
Type:
Enzyme Subunit
Mol. Mass.:
39047.01
Organism:
Homo sapiens (Human)
Description:
Residue:
346
  
Inhibitor
Name:
BDBM50431343
Synonyms:
CHEMBL2348654
Type:
Small organic molecule
Emp. Form.:
C16H14F3N5OS
Mol. Mass.:
381.375
SMILES:
CNc1nc(CC(F)(F)F)c(s1)-c1ccnc(Nc2cccc(O)c2)n1
: