Target
Cyclin-dependent kinase/G2/mitotic-specific cyclin- 1
Ligand
BDBM50431337
Substrate
Meas. Tech.
ChEMBL_954062 (CHEMBL2350830)
Ki
4±n/a nM
Citation
 Shao, HShi, SHuang, SHole, AJAbbas, AYBaumli, SLiu, XLam, FFoley, DWFischer, PMNoble, MEndicott, JAPepper, CWang, S Substituted 4-(thiazol-5-yl)-2-(phenylamino)pyrimidines are highly active CDK9 inhibitors: synthesis, X-ray crystal structures, structure-activity relationship, and anticancer activities. J Med Chem 56:640-59 (2013)  
Target
Name:
Cyclin-dependent kinase/G2/mitotic-specific cyclin- 1
Synonyms:
CDK1/B CDK1/CyclinB Cyclin-Dependent Kinase 1 (CDK1) Cyclin-dependent kinase/G2/mitotic-specific cyclin 1 | cdk1
Type:
Protein Complex
Mol. Mass.:
Description:
CDK1/Cyclin B complexes were purified from insect cells co-infected with baculovirus vectors containing each of the components.
Components:
This complex has 2 components.
Component 1
Name:
Cyclin-dependent kinase 1
Synonyms:
CDC2 CDK1 CDKN1 Cell division protein kinase 1 P34CDC2 | p34 protein kinase
Type:
Enzyme Subunit
Mol. Mass.:
34101.08
Organism:
Homo sapiens (Human)
Description:
P06493
Residue:
297
  
Component 2
Name:
G2/mitotic-specific cyclin-B1
Synonyms:
CCNB CCNB1_HUMAN
Type:
Enzyme Subunit
Mol. Mass.:
48340.95
Organism:
Homo sapiens (Human)
Description:
P14635
Residue:
433
  
Inhibitor
Name:
BDBM50431337
Synonyms:
CHEMBL2348845
Type:
Small organic molecule
Emp. Form.:
C14H14N6O2S2
Mol. Mass.:
362.43
SMILES:
CNc1ncc(s1)-c1ccnc(Nc2cccc(c2)S(N)(=O)=O)n1
: