Target
Heparanase
Ligand
BDBM50431663
Substrate
Meas. Tech.
ChEMBL_950897 (CHEMBL2349721)
IC50
200±n/a nM
Citation
 Gozalbes, RMosulén, SOrtí, LRodríguez-Díaz, JCarbajo, RJMelnyk, PPineda-Lucena, A Hit identification of novel heparanase inhibitors by structure- and ligand-based approaches. Bioorg Med Chem 21:1944-51 (2013)  
Target
Name:
Heparanase
Synonyms:
Endo-glucoronidase HPA HPR1 HPSE1 HSE1 Heparanase 8 kDa subunit | Heparanase-1
Type:
PROTEIN
Mol. Mass.:
61167.67
Organism:
Homo sapiens (Human)
Description:
ChEMBL_327900
Residue:
543
  
Inhibitor
Name:
BDBM50431663
Synonyms:
CHEMBL2349247
Type:
Small organic molecule
Emp. Form.:
C25H17Cl2FN2O3
Mol. Mass.:
483.318
SMILES:
CC(=O)Cc1ccc2oc(nc2c1)-c1ccc(\C=C\C(=O)Nc2ccc(Cl)c(Cl)c2)cc1F
: