Target
Hexokinase-4
Ligand
BDBM50431753
Substrate
Meas. Tech.
ChEMBL_951811 (CHEMBL2353001)
EC50
63±n/a nM
Citation
 Cheruvallath, ZSGwaltney, SLSabat, MTang, MFeng, JWang, HMiura, JGuntupalli, PJennings, AHosfield, DLee, BWu, Y Design, synthesis and SAR of novel glucokinase activators. Bioorg Med Chem Lett 23:2166-71 (2013)  
Target
Name:
Hexokinase-4
Synonyms:
GCK Glucokinase (GK) HK IV HXK4_HUMAN Hexokinase-D
Type:
Enzyme
Mol. Mass.:
52175.81
Organism:
Homo sapiens (Human)
Description:
P35557
Residue:
465
  
Inhibitor
Name:
BDBM50431753
Synonyms:
CHEMBL2346882
Type:
Small organic molecule
Emp. Form.:
C21H32N4O4S2
Mol. Mass.:
468.633
SMILES:
O=C(Nc1nccs1)[C@H](CC1CCCCC1)N1CCN(CC1=O)S(=O)(=O)C1CCCC1
: