Target
Hexokinase-4
Ligand
BDBM50431774
Substrate
Meas. Tech.
ChEMBL_951811 (CHEMBL2353001)
EC50
>100000±n/a nM
Citation
 Cheruvallath, ZSGwaltney, SLSabat, MTang, MFeng, JWang, HMiura, JGuntupalli, PJennings, AHosfield, DLee, BWu, Y Design, synthesis and SAR of novel glucokinase activators. Bioorg Med Chem Lett 23:2166-71 (2013)  
Target
Name:
Hexokinase-4
Synonyms:
GCK Glucokinase (GK) HK IV HXK4_HUMAN Hexokinase-D
Type:
Enzyme
Mol. Mass.:
52175.81
Organism:
Homo sapiens (Human)
Description:
P35557
Residue:
465
  
Inhibitor
Name:
BDBM50431774
Synonyms:
CHEMBL2346907
Type:
Small organic molecule
Emp. Form.:
C17H21N3OS
Mol. Mass.:
315.433
SMILES:
CC(C)CC(N1Cc2ccccc2C1)C(=O)Nc1nccs1
: