Target
Fibroblast growth factor receptor 3
Ligand
BDBM50431812
Substrate
Meas. Tech.
ChEMBL_952148 (CHEMBL2350675)
IC50
25±n/a nM
Citation
 Zhong, YXue, MZhao, XYuan, JLiu, XHuang, JZhao, ZLi, HXu, Y Substituted indolin-2-ones as p90 ribosomal S6 protein kinase 2 (RSK2) inhibitors: Molecular docking simulation and structure-activity relationship analysis. Bioorg Med Chem 21:1724-34 (2013)  
Target
Name:
Fibroblast growth factor receptor 3
Synonyms:
CD_antigen: CD333 FGFR3 Fibroblast growth factor receptor JTK4
Type:
Protein
Mol. Mass.:
87699.57
Organism:
Homo sapiens (Human)
Description:
P22607
Residue:
806
  
Inhibitor
Name:
BDBM50431812
Synonyms:
CHEMBL2347053
Type:
Small organic molecule
Emp. Form.:
C18H12N4O3
Mol. Mass.:
332.3129
SMILES:
[O-][N+](=O)c1ccccc1-c1n[nH]cc1C=C1C(=O)Nc2ccccc12
: