Target
Kinesin-like protein KIF11
Ligand
BDBM50260279
Substrate
Meas. Tech.
ChEMBL_953121 (CHEMBL2353360)
IC50
150±n/a nM
Citation
 El-Nassan, HB Advances in the discovery of kinesin spindle protein (Eg5) inhibitors as antitumor agents. Eur J Med Chem 62:614-31 (2013)  
Target
Name:
Kinesin-like protein KIF11
Synonyms:
EG5 KIF11_HUMAN Kinesin Spindle Protein Eg5 TRIP5 | kinesin spindle protein
Type:
PROTEIN
Mol. Mass.:
119138.97
Organism:
Homo sapiens (Human)
Description:
ChEMBL_1457426
Residue:
1056
  
Inhibitor
Name:
BDBM50260279
Synonyms:
(R)-(4-(3-hydroxyphenyl)-1,6-dimethyl-2-thioxo-1,2,3,4-tetrahydropyrimidin-5-yl)(phenyl)methanone [(4R)-4-(3-HYDROXYPHENYL)-1,6-DIMETHYL-2-THIOXO-1,2,3,4-TETRAHYDROPYRIMIDIN-5-YL](PHENYL)METHANONE
Type:
Small organic molecule
Emp. Form.:
C19H18N2O2S
Mol. Mass.:
338.423
SMILES:
CN1C(=S)N[C@@H](C(C(=O)c2ccccc2)=C1C)c1cccc(O)c1
: