Target
Kinesin-like protein KIF11
Ligand
BDBM50323768
Substrate
Meas. Tech.
ChEMBL_953359 (CHEMBL2350446)
IC50
2000±n/a nM
Citation
 El-Nassan, HB Advances in the discovery of kinesin spindle protein (Eg5) inhibitors as antitumor agents. Eur J Med Chem 62:614-31 (2013)  
Target
Name:
Kinesin-like protein KIF11
Synonyms:
EG5 KIF11_HUMAN Kinesin Spindle Protein Eg5 TRIP5 | kinesin spindle protein
Type:
PROTEIN
Mol. Mass.:
119138.97
Organism:
Homo sapiens (Human)
Description:
ChEMBL_1457426
Residue:
1056
  
Inhibitor
Name:
BDBM50323768
Synonyms:
(S)-4-(3-HYDROXYPHENYL)-2-THIOXO-1,2,3,4,7,8-HEXAHYDROQUINAZOLIN-5(6H)-ONE CHEMBL1213954
Type:
Small organic molecule
Emp. Form.:
C14H14N2O2S
Mol. Mass.:
274.338
SMILES:
Oc1cccc(c1)[C@@H]1NC(=S)N=C2CCCC(=O)C12
: