Target
Enoyl-acyl carrier reductase ENR
Ligand
BDBM50431919
Substrate
Meas. Tech.
ChEMBL_953658 (CHEMBL2352562)
IC50
965±n/a nM
Citation
 Cheng, GMuench, SPZhou, YAfanador, GAMui, EJFomovska, ALai, BSPrigge, STWoods, SRoberts, CWHickman, MRLee, PJLeed, SEAuschwitz, JMRice, DWMcLeod, R Design, synthesis, and biological activity of diaryl ether inhibitors of Toxoplasma gondii enoyl reductase. Bioorg Med Chem Lett 23:2035-43 (2013)  
Target
Name:
Enoyl-acyl carrier reductase ENR
Synonyms:
Enoyl-acyl carrier reductase Enoyl-acyl carrier reductase, putative
Type:
PROTEIN
Mol. Mass.:
43663.67
Organism:
Toxoplasma gondii
Description:
ChEMBL_1290812
Residue:
417
  
Inhibitor
Name:
BDBM50431919
Synonyms:
CHEMBL2347830
Type:
Small organic molecule
Emp. Form.:
C17H19ClN2O3S
Mol. Mass.:
366.862
SMILES:
CC(=O)N1CCN(Cc2ccc(Oc3ccc(Cl)cc3O)s2)CC1
: