Target
Enoyl-acyl carrier reductase ENR
Ligand
BDBM50431922
Substrate
Meas. Tech.
ChEMBL_953658 (CHEMBL2352562)
IC50
30±n/a nM
Citation
 Cheng, GMuench, SPZhou, YAfanador, GAMui, EJFomovska, ALai, BSPrigge, STWoods, SRoberts, CWHickman, MRLee, PJLeed, SEAuschwitz, JMRice, DWMcLeod, R Design, synthesis, and biological activity of diaryl ether inhibitors of Toxoplasma gondii enoyl reductase. Bioorg Med Chem Lett 23:2035-43 (2013)  
Target
Name:
Enoyl-acyl carrier reductase ENR
Synonyms:
Enoyl-acyl carrier reductase Enoyl-acyl carrier reductase, putative
Type:
PROTEIN
Mol. Mass.:
43663.67
Organism:
Toxoplasma gondii
Description:
ChEMBL_1290812
Residue:
417
  
Inhibitor
Name:
BDBM50431922
Synonyms:
5‐chloro‐2‐[2‐chloro‐4‐ (trifluoromethyl)phenoxy]phenol (31) | CHEMBL2347846
Type:
Small organic molecule
Emp. Form.:
C13H7Cl2F3O2
Mol. Mass.:
323.095
SMILES:
Oc1cc(Cl)ccc1Oc1ccc(cc1Cl)C(F)(F)F
: