Target
A disintegrin and metalloproteinase with thrombospondin motifs 5
Ligand
BDBM50128648
Substrate
Meas. Tech.
ChEMBL_953669 (CHEMBL2352573)
IC50
420±n/a nM
Citation
 Atobe, MMaekawara, NIshiguro, NSogame, SSuenaga, YKawanishi, MSuzuki, HJinno, NTanaka, EMiyoshi, S A series of thiazole derivatives bearing thiazolidin-4-one as non-competitive ADAMTS-5 (aggrecanase-2) inhibitors. Bioorg Med Chem Lett 23:2106-10 (2013)  
Target
Name:
A disintegrin and metalloproteinase with thrombospondin motifs 5
Synonyms:
A disintegrin and metalloproteinase with thrombospondin motifs 5 (ADAMTS-5) ADAMTS5 ATS5_HUMAN Metalloproteinase with thrombospondin motifs 5 (ADAMTS-5)
Type:
Enzyme
Mol. Mass.:
101769.09
Organism:
Homo sapiens (Human)
Description:
Q9UNA0
Residue:
930
  
Inhibitor
Name:
BDBM50128648
Synonyms:
1-Benzyl-4-[4-(4-chloro-phenoxy)-benzenesulfonyl]-piperidine-4-carboxylic acid hydroxyamide CHEMBL79433
Type:
Small organic molecule
Emp. Form.:
C25H25ClN2O5S
Mol. Mass.:
500.994
SMILES:
ONC(=O)C1(CCN(Cc2ccccc2)CC1)S(=O)(=O)c1ccc(Oc2ccc(Cl)cc2)cc1
: