Target
Disintegrin and metalloproteinase domain-containing protein 17
Ligand
BDBM50431947
Substrate
Meas. Tech.
ChEMBL_953674 (CHEMBL2352578)
IC50
>30000±n/a nM
Citation
 Atobe, MMaekawara, NIshiguro, NSogame, SSuenaga, YKawanishi, MSuzuki, HJinno, NTanaka, EMiyoshi, S A series of thiazole derivatives bearing thiazolidin-4-one as non-competitive ADAMTS-5 (aggrecanase-2) inhibitors. Bioorg Med Chem Lett 23:2106-10 (2013)  
Target
Name:
Disintegrin and metalloproteinase domain-containing protein 17
Synonyms:
ADA17_HUMAN CSVP Disintegrin and metalloproteinase domain-containing protein 17 (ADAM17) TNF-alpha convertase TNF-alpha-converting enzyme (TACE) Tumor necrosis factor-α converting enzyme (TACE)
Type:
Enzyme
Mol. Mass.:
93007.89
Organism:
Homo sapiens (Human)
Description:
Residue:
824
  
Inhibitor
Name:
BDBM50431947
Synonyms:
CHEMBL2348091
Type:
Small organic molecule
Emp. Form.:
C15H13N3O3S2
Mol. Mass.:
347.412
SMILES:
OC(=O)CCc1sc(\C=C2/NC(=O)CS2)nc1-c1ccccn1
: