Target
Arginase-1
Ligand
BDBM50431952
Substrate
Meas. Tech.
ChEMBL_954166 (CHEMBL2351681)
IC50
3260±n/a nM
Citation
 Golebiowski, APaul Beckett, RVan Zandt, MJi, MKWhitehouse, DRyder, TRJagdmann, EAndreoli, MMazur, APadmanilayam, MCousido-Siah, AMitschler, ARuiz, FXPodjarny, ASchroeter, H 2-Substituted-2-amino-6-boronohexanoic acids as arginase inhibitors. Bioorg Med Chem Lett 23:2027-30 (2013)  
Target
Name:
Arginase-1
Synonyms:
ARG1 Liver-type arginase | Type I arginase
Type:
PROTEIN
Mol. Mass.:
34737.53
Organism:
Homo sapiens (Human)
Description:
ChEMBL_978893
Residue:
322
  
Inhibitor
Name:
BDBM50431952
Synonyms:
CHEMBL2348491
Type:
Small organic molecule
Emp. Form.:
C14H23BN2O4
Mol. Mass.:
294.154
SMILES:
NC(CCCCB(O)O)(CNCc1ccccc1)C(O)=O
: