Target
Urotensin-2 receptor
Ligand
BDBM50431971
Substrate
Meas. Tech.
ChEMBL_954177 (CHEMBL2351692)
IC50
>10000±n/a nM
Citation
 Taylor, SJSoleymanzadeh, FMuegge, IAkiba, ITaki, NUeda, SMainolfi, EEldrup, AB Deconstruction of sulfonamide inhibitors of the urotensin receptor (UT) and design and synthesis of benzylamine and benzylsulfone antagonists. Bioorg Med Chem Lett 23:2177-80 (2013)  
Target
Name:
Urotensin-2 receptor
Synonyms:
G-protein coupled receptor 14 UR-II-R UTS2R Urotensin-II
Type:
Enzyme Catalytic Domain
Mol. Mass.:
42159.71
Organism:
Homo sapiens (Human)
Description:
Urotensin-II UTS2R HUMAN::Q9UKP6
Residue:
389
  
Inhibitor
Name:
BDBM50431971
Synonyms:
CHEMBL2348512
Type:
Small organic molecule
Emp. Form.:
C17H21ClN2O
Mol. Mass.:
304.814
SMILES:
CN(C)CCOc1cc(NCc2ccccc2)ccc1Cl
: