Target
Urotensin-2 receptor
Ligand
BDBM50431963
Substrate
Meas. Tech.
ChEMBL_954177 (CHEMBL2351692)
IC50
34±n/a nM
Citation
 Taylor, SJSoleymanzadeh, FMuegge, IAkiba, ITaki, NUeda, SMainolfi, EEldrup, AB Deconstruction of sulfonamide inhibitors of the urotensin receptor (UT) and design and synthesis of benzylamine and benzylsulfone antagonists. Bioorg Med Chem Lett 23:2177-80 (2013)  
Target
Name:
Urotensin-2 receptor
Synonyms:
G-protein coupled receptor 14 UR-II-R UTS2R Urotensin-II
Type:
Enzyme Catalytic Domain
Mol. Mass.:
42159.71
Organism:
Homo sapiens (Human)
Description:
Urotensin-II UTS2R HUMAN::Q9UKP6
Residue:
389
  
Inhibitor
Name:
BDBM50431963
Synonyms:
CHEMBL2348502
Type:
Small organic molecule
Emp. Form.:
C20H23BrClNO5S
Mol. Mass.:
504.822
SMILES:
COc1cc(Br)c(cc1OC)S(=O)(=O)Cc1ccc(Cl)c(O[C@@H]2CCN(C)C2)c1
: