Target
Urotensin-2 receptor
Ligand
BDBM50431976
Substrate
Meas. Tech.
ChEMBL_954176 (CHEMBL2351691)
IC50
1328±n/a nM
Citation
 Taylor, SJSoleymanzadeh, FMuegge, IAkiba, ITaki, NUeda, SMainolfi, EEldrup, AB Deconstruction of sulfonamide inhibitors of the urotensin receptor (UT) and design and synthesis of benzylamine and benzylsulfone antagonists. Bioorg Med Chem Lett 23:2177-80 (2013)  
Target
Name:
Urotensin-2 receptor
Synonyms:
G-protein coupled receptor 14 UR-II-R UTS2R Urotensin-II
Type:
Enzyme Catalytic Domain
Mol. Mass.:
42159.71
Organism:
Homo sapiens (Human)
Description:
Urotensin-II UTS2R HUMAN::Q9UKP6
Residue:
389
  
Inhibitor
Name:
BDBM50431976
Synonyms:
CHEMBL2348506
Type:
Small organic molecule
Emp. Form.:
C20H24BrClN2O3
Mol. Mass.:
455.773
SMILES:
COc1cc(Br)c(CNc2ccc(Cl)c(O[C@@H]3CCN(C)C3)c2)cc1OC
: