Target
Dual specificity tyrosine-phosphorylation-regulated kinase 1A
Ligand
BDBM50431992
Substrate
Meas. Tech.
ChEMBL_949839 (CHEMBL2351432)
IC50
>10000±n/a nM
Citation
 Elagawany, MIbrahim, MAAli Ahmed, HEEl-Etrawy, AShGhiaty, AAbdel-Samii, ZKEl-Feky, SABajorath, J Design, synthesis, and molecular modelling of pyridazinone and phthalazinone derivatives as protein kinases inhibitors. Bioorg Med Chem Lett 23:2007-13 (2013)  
Target
Name:
Dual specificity tyrosine-phosphorylation-regulated kinase 1A
Synonyms:
DYR1A_RAT Dual-specificity tyrosine-(Y)-phosphorylation regulated kinase 1A Dyrk1a
Type:
Enzyme Catalytic Domain
Mol. Mass.:
85573.59
Organism:
RAT
Description:
Dual-specificity tyrosine-(Y)-phosphorylation regulated kinase 1A 0 RAT::Q63470
Residue:
763
  
Inhibitor
Name:
BDBM50431992
Synonyms:
CHEMBL2348748
Type:
Small organic molecule
Emp. Form.:
C13H15N3O
Mol. Mass.:
229.2777
SMILES:
CCCNc1cc(-c2ccccc2)c(=O)[nH]n1
: