Target
Cyclin-dependent kinase 5 activator 1
Ligand
BDBM50432002
Substrate
Meas. Tech.
ChEMBL_954190 (CHEMBL2351705)
IC50
>10000±n/a nM
Citation
 Elagawany, MIbrahim, MAAli Ahmed, HEEl-Etrawy, AShGhiaty, AAbdel-Samii, ZKEl-Feky, SABajorath, J Design, synthesis, and molecular modelling of pyridazinone and phthalazinone derivatives as protein kinases inhibitors. Bioorg Med Chem Lett 23:2007-13 (2013)  
Target
Name:
Cyclin-dependent kinase 5 activator 1
Synonyms:
CDK5/p35 Cyclin-dependent kinase 5 regulatory subunit 1 | Cyclin-dependent kinase 5/CDK5 activator 1
Type:
Protein Complex
Mol. Mass.:
Description:
Components:
This complex has 2 components.
Component 1
Name:
Cyclin-dependent kinase 5
Synonyms:
CDK5 CDKN5 Cyclin-dependent kinase 5 (CDK5/ p25) Cyclin-dependent-like kinase 5 PSSALRE Tau protein kinase II catalytic subunit
Type:
Enzyme Subunit
Mol. Mass.:
33308.61
Organism:
Homo sapiens (Human)
Description:
Residue:
292
  
Component 2
Name:
Cyclin-dependent kinase 5 activator 1
Synonyms:
CD5R1_HUMAN CDK5R1 Cyclin-dependent kinase 5 (CDK5/p25) NCK5A p35
Type:
Enzyme Subunit
Mol. Mass.:
34077.43
Organism:
Homo sapiens (Human)
Description:
Q15078
Residue:
307
  
Inhibitor
Name:
BDBM50432002
Synonyms:
CHEMBL2348741
Type:
Small organic molecule
Emp. Form.:
C12H11N3O3
Mol. Mass.:
245.234
SMILES:
CC(=O)N(C(C)=O)c1n[nH]c(=O)c2ccccc12
: