Target
Dual specificity tyrosine-phosphorylation-regulated kinase 1A
Ligand
BDBM50432010
Substrate
Meas. Tech.
ChEMBL_949839 (CHEMBL2351432)
IC50
>10000±n/a nM
Citation
 Elagawany, MIbrahim, MAAli Ahmed, HEEl-Etrawy, AShGhiaty, AAbdel-Samii, ZKEl-Feky, SABajorath, J Design, synthesis, and molecular modelling of pyridazinone and phthalazinone derivatives as protein kinases inhibitors. Bioorg Med Chem Lett 23:2007-13 (2013)  
Target
Name:
Dual specificity tyrosine-phosphorylation-regulated kinase 1A
Synonyms:
DYR1A_RAT Dual-specificity tyrosine-(Y)-phosphorylation regulated kinase 1A Dyrk1a
Type:
Enzyme Catalytic Domain
Mol. Mass.:
85573.59
Organism:
RAT
Description:
Dual-specificity tyrosine-(Y)-phosphorylation regulated kinase 1A 0 RAT::Q63470
Residue:
763
  
Inhibitor
Name:
BDBM50432010
Synonyms:
CHEMBL2348733
Type:
Small organic molecule
Emp. Form.:
C10H9N3O
Mol. Mass.:
187.198
SMILES:
Nc1n[nH]c(=O)cc1-c1ccccc1
: