Target
Corticotropin-releasing factor receptor 1
Ligand
BDBM50432108
Substrate
Meas. Tech.
ChEMBL_950616 (CHEMBL2352366)
IC50
4.5±n/a nM
Citation
 Denhart, DJZuev, DDitta, JLHartz, RAAhuja, VTMattson, RJHuang, HMattson, GKZueva, LNielsen, JMKozlowski, ESLodge, NJBronson, JJMacor, JE Potential CRF1R PET imaging agents: 1-fluoroalkylsubstituted 5-halo-3-(arylamino)pyrazin-2(1H)-ones. Bioorg Med Chem Lett 23:2052-5 (2013)  
Target
Name:
Corticotropin-releasing factor receptor 1
Synonyms:
CRF-R CRFR1_RAT Corticotropin releasing factor receptor Corticotropin-releasing Factor Receptor 1 Crhr | Crhr1
Type:
G Protein-Coupled Receptor (GPCR)
Mol. Mass.:
47870.75
Organism:
Rattus norvegicus (rat)
Description:
Receptor binding assays were performed using rat cortex homogenate.
Residue:
415
  
Inhibitor
Name:
BDBM50432108
Synonyms:
CHEMBL2349564
Type:
Small organic molecule
Emp. Form.:
C19H19Cl2FN4O2
Mol. Mass.:
425.284
SMILES:
Cc1cc(cc(Cl)c1Nc1nc(Cl)cn([C@@H](COCCF)C2CC2)c1=O)C#N
: