Target
Extracellular calcium-sensing receptor
Ligand
BDBM50432143
Substrate
Meas. Tech.
ChEMBL_950625 (CHEMBL2352375)
EC50
2000±n/a nM
Citation
 Temal, TJary, HAuberval, MLively, SGuédin, DVevert, JPDeprez, P New potent calcimimetics: I. Discovery of a series of novel trisubstituted ureas. Bioorg Med Chem Lett 23:2451-4 (2013)  
Target
Name:
Extracellular calcium-sensing receptor
Synonyms:
CASR CaR Calcium-sensing receptor (CaSR) GPRC2A Parathyroid Cell calcium-sensing receptor Synonyms=GPRC2A | hCasR
Type:
Protein
Mol. Mass.:
120663.13
Organism:
Homo sapiens (Human)
Description:
P41180
Residue:
1078
  
Inhibitor
Name:
BDBM50432143
Synonyms:
CHEMBL2349579
Type:
Small organic molecule
Emp. Form.:
C29H33N3O4
Mol. Mass.:
487.59
SMILES:
OC(=O)c1cccc(NC(=O)N(CCC(c2ccccc2)c2ccccc2)CCN2CCOCC2)c1
: