Target
Androgen receptor
Ligand
BDBM50432188
Substrate
Meas. Tech.
ChEMBL_950667 (CHEMBL2352670)
Ki
5000±n/a nM
Citation
 Bradbury, RHActon, DGBroadbent, NLBrooks, ANCarr, GRHatter, GHayter, BRHill, KJHowe, NJJones, RDJude, DLamont, SGLoddick, SAMcFarland, HLParveen, ZRabow, AASharma-Singh, GStratton, NCThomason, AGTrueman, DWalker, GEWells, SLWilson, JWood, JM Discovery of AZD3514, a small-molecule androgen receptor downregulator for treatment of advanced prostate cancer. Bioorg Med Chem Lett 23:1945-8 (2013)  
Target
Name:
Androgen receptor
Synonyms:
ANDR_RAT Ar Nr3c4 | androgen
Type:
Enzyme
Mol. Mass.:
98219.08
Organism:
Rattus norvegicus (Rat)
Description:
P15207
Residue:
902
  
Inhibitor
Name:
BDBM50432188
Synonyms:
CHEMBL2346976
Type:
Small organic molecule
Emp. Form.:
C25H32F3N7O2
Mol. Mass.:
519.5625
SMILES:
CC(=O)N1CCN(CCOc2ccc(cc2)C2CCN(CC2)C2=Nn3c(CC2)nnc3C(F)(F)F)CC1
: