Target
Lactase/phlorizin hydrolase
Ligand
BDBM50432217
Substrate
Meas. Tech.
ChEMBL_950939 (CHEMBL2350012)
IC50
>200000±n/a nM
Citation
 Bian, XWang, QKe, CZhao, GLi, Y A new series of N2-substituted-5-(p-toluenesulfonylamino)phthalimide analogues asa-glucosidase inhibitors. Bioorg Med Chem Lett 23:2022-6 (2013)  
Target
Name:
Lactase/phlorizin hydrolase
Synonyms:
LPH_RAT Lct | Lph
Type:
PROTEIN
Mol. Mass.:
217253.31
Organism:
Rattus norvegicus
Description:
ChEMBL_96426
Residue:
1928
  
Inhibitor
Name:
BDBM50432217
Synonyms:
CHEMBL2347148
Type:
Small organic molecule
Emp. Form.:
C20H21N3O4S
Mol. Mass.:
399.463
SMILES:
Cc1ccc(cc1)S(=O)(=O)Nc1ccc2C(=O)N(N3CCCCC3)C(=O)c2c1
: