Target
Cell division cycle 7-related protein kinase
Ligand
BDBM50432336
Substrate
Meas. Tech.
ChEMBL_951879 (CHEMBL2353507)
IC50
7.0±n/a nM
Citation
 Bryan, MCFalsey, JRFrohn, MReichelt, AYao, GBartberger, MDBailis, JMZalameda, LMiguel, TSDoherty, EMAllen, JG N-substituted azaindoles as potent inhibitors of Cdc7 kinase. Bioorg Med Chem Lett 23:2056-60 (2013)  
Target
Name:
Cell division cycle 7-related protein kinase
Synonyms:
CDC7 CDC7L1 Cell division cycle 7-related protein kinase (CDC7) huCdc7
Type:
Protein
Mol. Mass.:
63908.16
Organism:
Homo sapiens (Human)
Description:
O00311
Residue:
574
  
Inhibitor
Name:
BDBM50432336
Synonyms:
CHEMBL2348154
Type:
Small organic molecule
Emp. Form.:
C16H11ClN6
Mol. Mass.:
322.752
SMILES:
Nc1nccc(n1)-n1cc(-c2cccnc2Cl)c2cnccc12
: