Target
Mitogen-activated protein kinase 9
Ligand
BDBM50432394
Substrate
Meas. Tech.
ChEMBL_952815 (CHEMBL2351320)
IC50
2180±n/a nM
Citation
 Kim, MHLee, JJung, KKim, MPark, YJAhn, HKwon, YHHah, JM Syntheses and biological evaluation of 1-heteroaryl-2-aryl-1H-benzimidazole derivatives as c-Jun N-terminal kinase inhibitors with neuroprotective effects. Bioorg Med Chem 21:2271-85 (2013)  
Target
Name:
Mitogen-activated protein kinase 9
Synonyms:
JNK-55 JNK2/JNK3 MK09_HUMAN Mitogen-activated protein kinase 8/9 SAPK1A c-Jun N-terminal kinase 2 | c-Jun N-terminal kinase 2 (JNK2)
Type:
Enzyme
Mol. Mass.:
48131.49
Organism:
Homo sapiens (Human)
Description:
JNK-2 was purchased from Upstate Cell Signaling Solutions (formerly Upstate Biotechnology).
Residue:
424
  
Inhibitor
Name:
BDBM50432394
Synonyms:
CHEMBL2348581
Type:
Small organic molecule
Emp. Form.:
C23H23N5O
Mol. Mass.:
385.4616
SMILES:
Oc1cccc(c1)-c1nc2ccccc2n1-c1ccnc(N[C@@H]2CCCNC2)c1
: