Target
Mitogen-activated protein kinase 10
Ligand
BDBM50430432
Substrate
Meas. Tech.
ChEMBL_952816 (CHEMBL2351321)
Kd
46±n/a nM
Citation
 Kim, MHLee, JJung, KKim, MPark, YJAhn, HKwon, YHHah, JM Syntheses and biological evaluation of 1-heteroaryl-2-aryl-1H-benzimidazole derivatives as c-Jun N-terminal kinase inhibitors with neuroprotective effects. Bioorg Med Chem 21:2271-85 (2013)  
Target
Name:
Mitogen-activated protein kinase 10
Synonyms:
JNK3 MAP kinase p49 3F12 MK10_HUMAN Mitogen-activated protein kinase 10 (Stress-activated protein kinase JNK3) (c-Jun N-terminal kinase 3) (MAP kinase p49 3F12) PRKM10 Stress-activated protein kinase JNK3 | c-Jun N-terminal kinase 3 (JNK3)
Type:
Enzyme
Mol. Mass.:
52586.89
Organism:
Homo sapiens (Human)
Description:
Residue:
464
  
Inhibitor
Name:
BDBM50430432
Synonyms:
CHEMBL2334705
Type:
Small organic molecule
Emp. Form.:
C30H28N6O2
Mol. Mass.:
504.5823
SMILES:
Oc1ccc2nc(-c3ccc4ccccc4c3)n(-c3ccnc(N[C@@H]4CCCN(C4)C(=O)C4CC4)n3)c2c1
: