Target
CX3C chemokine receptor 1
Ligand
BDBM50432447
Substrate
Meas. Tech.
ChEMBL_953474 (CHEMBL2351085)
Ki
560±n/a nM
Citation
 Karlström, SNordvall, GSohn, DHettman, ATurek, DÅhlin, KKers, AClaesson, MSlivo, CLo-Alfredsson, YPetersson, CBessidskaia, GSvensson, PHRein, TJerning, EMalmberg, ÅAhlgen, CRay, CVares, LIvanov, VJohansson, R Substituted 7-amino-5-thio-thiazolo[4,5-d]pyrimidines as potent and selective antagonists of the fractalkine receptor (CX3CR1). J Med Chem 56:3177-90 (2013)  
Target
Name:
CX3C chemokine receptor 1
Synonyms:
C-X3-C chemokine receptor 1 CX3C1_HUMAN GPR13
Type:
PROTEIN
Mol. Mass.:
40399.45
Organism:
Homo sapiens (Human)
Description:
ChEMBL_953474
Residue:
355
  
Inhibitor
Name:
BDBM50432447
Synonyms:
CHEMBL2349334
Type:
Small organic molecule
Emp. Form.:
C16H18N4O2S2
Mol. Mass.:
362.47
SMILES:
CC[C@H](CO)Nc1nc(SCc2ccccc2)[nH]c2nc(=O)sc12
: