Target
Bromodomain-containing protein 4
Ligand
BDBM50432486
Substrate
Meas. Tech.
ChEMBL_953486 (CHEMBL2351097)
IC50
4100±n/a nM
Citation
 Zhao, LCao, DChen, TWang, YMiao, ZXu, YChen, WWang, XLi, YDu, ZXiong, BLi, JXu, CZhang, NHe, JShen, J Fragment-based drug discovery of 2-thiazolidinones as inhibitors of the histone reader BRD4 bromodomain. J Med Chem 56:3833-51 (2013)  
Target
Name:
Bromodomain-containing protein 4
Synonyms:
BRD4 Bromodomain-containing protein 4 (BRD4) Protein HUNK1
Type:
Protein
Mol. Mass.:
152264.84
Organism:
Homo sapiens (Human)
Description:
O60885
Residue:
1362
  
Inhibitor
Name:
BDBM50432486
Synonyms:
CHEMBL2349349
Type:
Small organic molecule
Emp. Form.:
C13H10N2O3S3
Mol. Mass.:
338.425
SMILES:
O=c1[nH]c(cs1)-c1cccc(NS(=O)(=O)c2cccs2)c1
: